Reaction Details
TargetKappa-type opioid receptor
LigandBDBM50171154
Substrate/Competitorn/a
Meas. Tech.ChEMBL_322129 (CHEMBL884380)
EC50 227±n/a nM
Citation Lee, DYHe, MKondaveti, LLiu-Chen, LYMa, ZWang, YChen, YLi, JGBeguin, CCarlezon, WACohen, B Synthesis and in vitro pharmacological studies of C(4) modified salvinorin A analogues. Bioorg Med Chem Lett15:4169-73 (2005) 
 
Kappa-type opioid receptor
Name:Kappa-type opioid receptor
Type:G Protein-Coupled Receptor (GPCR)
Mol. Mass.:42648.76
Organism:Homo sapiens (Human)
Description:P41145
Residue:380
BDBM50171154
NameBDBM50171154
Synonyms:CHEMBL263576 | [((3S,4aR,4bS,6S,8R,8aR,10aR)-6-Acetoxy-3-furan-3-yl-4a,8a-dimethyl-1,5-dioxo-dodecahydro-2-oxa-phenanthrene-8-carbonyl)-amino]-acetic acid benzyl ester
TypeSmall organic molecule
Emp. Form.C31H35NO9
Mol. Mass.565.6109
SMILESCC(=O)O[C@H]1C[C@@H](C(=O)NCC(=O)OCc2ccccc2)[C@]2(C)CC[C@H]3C(=O)O[C@@H](C[C@]3(C)[C@H]2C1=O)c1ccoc1