Reaction Details
TargetKappa-type opioid receptor
LigandBDBM50171159
Substrate/Competitorn/a
Meas. Tech.ChEMBL_320955 (CHEMBL885362)
Ki>1000±n/a nM
Citation Lee, DYHe, MKondaveti, LLiu-Chen, LYMa, ZWang, YChen, YLi, JGBeguin, CCarlezon, WACohen, B Synthesis and in vitro pharmacological studies of C(4) modified salvinorin A analogues. Bioorg Med Chem Lett15:4169-73 (2005) 
 
Kappa-type opioid receptor
Name:Kappa-type opioid receptor
Type:G Protein-Coupled Receptor (GPCR)
Mol. Mass.:42648.76
Organism:Homo sapiens (Human)
Description:P41145
Residue:380
BDBM50171159
NameBDBM50171159
Synonyms:Acetic acid (3S,4aR,4bS,6S,8R,8aR,10aR)-3-furan-3-yl-4a,8a-dimethyl-8-(4-methyl-piperidin-1-ylcarbamoyl)-1,5-dioxo-dodecahydro-2-oxa-phenanthren-6-yl ester | CHEMBL196429
TypeSmall organic molecule
Emp. Form.C28H38N2O7
Mol. Mass.514.6105
SMILESCC1CCN(CC1)NC(=O)[C@@H]1C[C@H](OC(C)=O)C(=O)[C@H]2[C@@]1(C)CC[C@H]1C(=O)O[C@@H](C[C@]21C)c1ccoc1