Reaction Details
TargetKappa-type opioid receptor
LigandBDBM50171163
Substrate/Competitorn/a
Meas. Tech.ChEMBL_320955 (CHEMBL885362)
Ki>1000±n/a nM
Citation Lee, DYHe, MKondaveti, LLiu-Chen, LYMa, ZWang, YChen, YLi, JGBeguin, CCarlezon, WACohen, B Synthesis and in vitro pharmacological studies of C(4) modified salvinorin A analogues. Bioorg Med Chem Lett15:4169-73 (2005) 
 
Kappa-type opioid receptor
Name:Kappa-type opioid receptor
Type:G Protein-Coupled Receptor (GPCR)
Mol. Mass.:42648.76
Organism:Homo sapiens (Human)
Description:P41145
Residue:380
BDBM50171163
NameBDBM50171163
Synonyms:Acetic acid (3S,4aR,4bS,6S,8R,8aR,10aR)-3-furan-3-yl-4a,8a-dimethyl-1,5-dioxo-8-phenethylcarbamoyl-dodecahydro-2-oxa-phenanthren-6-yl ester | CHEMBL194210
TypeSmall organic molecule
Emp. Form.C30H35NO7
Mol. Mass.521.6014
SMILESCC(=O)O[C@H]1C[C@@H](C(=O)NCCc2ccccc2)[C@]2(C)CC[C@H]3C(=O)O[C@@H](C[C@]3(C)[C@H]2C1=O)c1ccoc1