Reaction Details
TargetThromboxane A2 receptor
LigandBDBM50171481
Substrate/Competitorn/a
Meas. Tech.ChEMBL_303672 (CHEMBL830433)
Ki 5100±n/a nM
Citation Ohno, MMiyamoto, MHoshi, KTakeda, TYamada, NOhtake, A Development of dual-acting benzofurans for thromboxane A2 receptor antagonist and prostacyclin receptor agonist: synthesis, structure-activity relationship, and evaluation of benzofuran derivatives. J Med Chem48:5279-94 (2005) 
 
Thromboxane A2 receptor
Name:Thromboxane A2 receptor
Type:Enyzme
Mol. Mass.:37445.28
Organism:Homo sapiens (Human)
Description:P21731
Residue:343
BDBM50171481
NameBDBM50171481
Synonyms:(3-Benzhydrylsulfanylmethyl-benzofuran-7-yloxy)-acetic acid | CHEMBL192661
TypeSmall organic molecule
Emp. Form.C24H20O4S
Mol. Mass.404.478
SMILESOC(=O)COc1cccc2c(CSC(c3ccccc3)c3ccccc3)coc12