Reaction Details
TargetEpidermal growth factor receptor
LigandBDBM50171524
Substrate/Competitorn/a
Meas. Tech.ChEMBL_306070 (CHEMBL833025)
IC50<5±n/a nM
Citation Mishani, EAbourbeh, GJacobson, ODissoki, SBen Daniel, RRozen, YShaul, MLevitzki, A High-affinity epidermal growth factor receptor (EGFR) irreversible inhibitors with diminished chemical reactivities as positron emission tomography (PET)-imaging agent candidates of EGFR overexpressing tumors. J Med Chem48:5337-48 (2005) 
 
Epidermal growth factor receptor
Name:Epidermal growth factor receptor
Type:Receptor Kinase Domain
Mol. Mass.:134279.59
Organism:Homo sapiens (Human)
Description:P00533
Residue:1210
BDBM50171524
NameBDBM50171524
Synonyms:(E)-4-Dimethylamino-but-2-enoic acid [4-(3-iodo-phenylamino)-quinazolin-6-yl]-amide | CHEMBL189779
TypeSmall organic molecule
Emp. Form.C20H20IN5O
Mol. Mass.473.3102
SMILESCN(C)C\C=C\C(=O)Nc1ccc2ncnc(Nc3cccc(I)c3)c2c1