Reaction Details
TargetEpidermal growth factor receptor
LigandBDBM50171523
Substrate/Competitorn/a
Meas. Tech.ChEMBL_306538 (CHEMBL827827)
IC50 5±n/a nM
Citation Mishani, EAbourbeh, GJacobson, ODissoki, SBen Daniel, RRozen, YShaul, MLevitzki, A High-affinity epidermal growth factor receptor (EGFR) irreversible inhibitors with diminished chemical reactivities as positron emission tomography (PET)-imaging agent candidates of EGFR overexpressing tumors. J Med Chem48:5337-48 (2005) 
 
Epidermal growth factor receptor
Name:Epidermal growth factor receptor
Type:Receptor Kinase Domain
Mol. Mass.:134279.59
Organism:Homo sapiens (Human)
Description:P00533
Residue:1210
BDBM50171523
NameBDBM50171523
Synonyms:(4,5-Dichloro-2-fluoro-phenyl)-(6,7-dimethoxy-quinazolin-4-yl)-amine | CHEMBL437879
TypeSmall organic molecule
Emp. Form.C16H12Cl2FN3O2
Mol. Mass.368.19
SMILESCOc1cc2ncnc(Nc3cc(Cl)c(Cl)cc3F)c2cc1OC