Reaction Details
TargetEpidermal growth factor receptor
LigandBDBM50171516
Substrate/Competitorn/a
Meas. Tech.ChEMBL_305171 (CHEMBL832761)
IC50 0.04±n/a nM
Citation Mishani, EAbourbeh, GJacobson, ODissoki, SBen Daniel, RRozen, YShaul, MLevitzki, A High-affinity epidermal growth factor receptor (EGFR) irreversible inhibitors with diminished chemical reactivities as positron emission tomography (PET)-imaging agent candidates of EGFR overexpressing tumors. J Med Chem48:5337-48 (2005) 
 
Epidermal growth factor receptor
Name:Epidermal growth factor receptor
Type:Receptor Kinase Domain
Mol. Mass.:134279.59
Organism:Homo sapiens (Human)
Description:P00533
Residue:1210
BDBM50171516
NameBDBM50171516
Synonyms:CHEMBL363815 | N-[4-(4,5-Dichloro-2-fluoro-phenylamino)-quinazolin-6-yl]-acrylamide
TypeSmall organic molecule
Emp. Form.C17H11Cl2FN4O
Mol. Mass.377.2
SMILESFc1cc(Cl)c(Cl)cc1Nc1ncnc2ccc(NC(=O)C=C)cc12