Reaction Details
TargetSigma intracellular receptor 2
LigandBDBM50064946
Substrate/Competitorn/a
Meas. Tech.ChEMBL_2220293 (CHEMBL5133627)
Ki 2.4±n/a nM
Citation Dichiara, MArtacho-Cordón, ATurnaturi, RSantos-Caballero, MGonzález-Cano, RPasquinucci, LBarbaraci, CRodríguez-Gómez, IGómez-Guzmán, MMarrazzo, ACobos, EJAmata, E Dual Sigma-1 receptor antagonists and hydrogen sulfide-releasing compounds for pain treatment: Design, synthesis, and pharmacological evaluation. Eur J Med Chem230:0 (2022) 
 
Sigma intracellular receptor 2
Name:Sigma intracellular receptor 2
Type:Protein
Mol. Mass.:20953.88
Organism:Rattus norvegicus (Rat)
Description:Q5U3Y7
Residue:176
BDBM50064946
NameBDBM50064946
Synonyms:4-(4-Chloro-phenyl)-1-[4-(4-fluoro-phenyl)-4-hydroxy-butyl]-piperidin-4-ol Hydroxyhaloperidol
TypeSmall organic molecule
Emp. Form.C21H25ClFNO2
Mol. Mass.377.88
SMILESOC(CCCN1CCC(O)(CC1)c1ccc(Cl)cc1)c1ccc(F)cc1