Reaction Details
TargetSigma non-opioid intracellular receptor 1
LigandBDBM50001028
Substrate/Competitorn/a
Meas. Tech.ChEMBL_2220294 (CHEMBL5133628)
Ki 4.3±n/a nM
Citation Dichiara, MArtacho-Cordón, ATurnaturi, RSantos-Caballero, MGonzález-Cano, RPasquinucci, LBarbaraci, CRodríguez-Gómez, IGómez-Guzmán, MMarrazzo, ACobos, EJAmata, E Dual Sigma-1 receptor antagonists and hydrogen sulfide-releasing compounds for pain treatment: Design, synthesis, and pharmacological evaluation. Eur J Med Chem230:0 (2022) 
 
Sigma non-opioid intracellular receptor 1
Name:Sigma non-opioid intracellular receptor 1
Type:Protein
Mol. Mass.:25307.17
Organism:Cavia porcellus (Guinea pig)
Description:Q60492
Residue:223
BDBM50001028
NameBDBM50001028
Synonyms:(+)-PENTAZOCINE (2R,6R,11R)-6,11-Dimethyl-3-(3-methyl-but-2-enyl)-1,2,3,4,5,6-hexahydro-2,6-methano-benzo[d]azocin-8-ol 6,11-Dimethyl-3-(3-methyl-but-2-enyl)-1,2,3,4,5,6-hexahydro-2,6-methano-benzo[d]azocin-8-ol CHEMBL560 PENTAZOCINE (-) Pentazocine,(+/-) Talwin US10736890, Compound TABLE B.8 US9656961, Example 00125 | rel-(2R,6R,11R)-6,11-Dimethyl-3-(3-methyl-but-2-enyl)-1,2,3,4,5,6-hexahydro-2,6-methano-benzo[d]azocin-8-ol
TypeSmall organic molecule
Emp. Form.C19H27NO
Mol. Mass.285.4238
SMILES[#6]-[#6@H]1-[#6@H]-2-[#6]-c3ccc(-[#8])cc3[C@]1([#6])[#6]-[#6]-[#7]-2-[#6]\[#6]=[#6](\[#6])-[#6]