Reaction Details
Target5-hydroxytryptamine receptor 2A
LigandBDBM50171669
Substrate/Competitorn/a
Meas. Tech.ChEMBL_320904 (CHEMBL872403)
Ki 0.3±n/a nM
Citation Singer, JMBarr, BMCoughenour, LLGregory, TFWalters, MA 8-Substituted 3,4-dihydroquinolinones as a novel scaffold for atypical antipsychotic activity. Bioorg Med Chem Lett15:4560-3 (2005) 
 
5-hydroxytryptamine receptor 2A
Name:5-hydroxytryptamine receptor 2A
Type:undefined
Mol. Mass.:52607.65
Organism:Homo sapiens (Human)
Description:P28223
Residue:471
BDBM50171669
NameBDBM50171669
Synonyms:1-{8-[2-(4-Benzo[d]isothiazol-3-yl-piperazin-1-yl)-ethyl]-4-methyl-3,4-dihydro-2H-quinolin-1-yl}-ethanone | CHEMBL369913
TypeSmall organic molecule
Emp. Form.C25H30N4OS
Mol. Mass.434.597
SMILESCC1CCN(C(C)=O)c2c(CCN3CCN(CC3)c3nsc4ccccc34)cccc12