Reaction Details
Target5-hydroxytryptamine receptor 2A
LigandBDBM50171682
Substrate/Competitorn/a
Meas. Tech.ChEMBL_320904 (CHEMBL872403)
Ki 0.31±n/a nM
Citation Singer, JMBarr, BMCoughenour, LLGregory, TFWalters, MA 8-Substituted 3,4-dihydroquinolinones as a novel scaffold for atypical antipsychotic activity. Bioorg Med Chem Lett15:4560-3 (2005) 
 
5-hydroxytryptamine receptor 2A
Name:5-hydroxytryptamine receptor 2A
Type:undefined
Mol. Mass.:52607.65
Organism:Homo sapiens (Human)
Description:P28223
Residue:471
BDBM50171682
NameBDBM50171682
Synonyms:1-{8-[2-(4-Benzo[d]isothiazol-3-yl-piperazin-1-yl)-ethyl]-6-chloro-4-methyl-3,4-dihydro-2H-quinolin-1-yl}-ethanone | CHEMBL199182
TypeSmall organic molecule
Emp. Form.C25H29ClN4OS
Mol. Mass.469.042
SMILESCC1CCN(C(C)=O)c2c(CCN3CCN(CC3)c3nsc4ccccc34)cc(Cl)cc12