Reaction Details
TargetD(2) dopamine receptor
LigandBDBM50171681
Substrate/Competitorn/a
Meas. Tech.ChEMBL_320893 (CHEMBL872392)
Ki 11±n/a nM
Citation Singer, JMBarr, BMCoughenour, LLGregory, TFWalters, MA 8-Substituted 3,4-dihydroquinolinones as a novel scaffold for atypical antipsychotic activity. Bioorg Med Chem Lett15:4560-3 (2005) 
 
D(2) dopamine receptor
Name:D(2) dopamine receptor
Type:Cell-surface receptors
Mol. Mass.:50647.10
Organism:Homo sapiens (Human)
Description:P14416
Residue:443
BDBM50171681
NameBDBM50171681
Synonyms:8-[2-(4-Benzo[d]isothiazol-3-yl-piperazin-1-yl)-ethyl]-4,5-dimethyl-3,4-dihydro-1H-quinolin-2-one | CHEMBL440389
TypeSmall organic molecule
Emp. Form.C24H28N4OS
Mol. Mass.420.57
SMILESCC1CC(=O)Nc2c(CCN3CCN(CC3)c3nsc4ccccc34)ccc(C)c12