Reaction Details
TargetThyroid hormone receptor beta
LigandBDBM50171808
Substrate/Competitorn/a
Meas. Tech.ChEMBL_321321 (CHEMBL882591)
IC50 0.3±n/a nM
Citation Hangeland, JJFriends, TJDoweyko, AMMellström, KSandberg, JGrynfarb, MRyono, DE A new class of high affinity thyromimetics containing a phenyl-naphthylene core. Bioorg Med Chem Lett15:4579-84 (2005) 
 
Thyroid hormone receptor beta
Name:Thyroid hormone receptor beta
Type:Receptor
Mol. Mass.:52793.62
Organism:Homo sapiens (Human)
Description:Recombinant hThR was obtained from nuclear extracts from SF9 cells infected with baculovirus vectors encoding for ThRbeta 1.
Residue:461
BDBM50171808
NameBDBM50171808
Synonyms:CHEMBL194242 | N-[4-(5-Bromo-6-hydroxy-naphthalen-1-yl)-3,5-dichloro-phenyl]-malonamic acid
TypeSmall organic molecule
Emp. Form.C19H12BrCl2NO4
Mol. Mass.469.113
SMILESOC(=O)CC(=O)Nc1cc(Cl)c(c(Cl)c1)-c1cccc2c(Br)c(O)ccc12