Reaction Details
TargetMatrix metalloproteinase-9
LigandBDBM50024401
Substrate/Competitorn/a
Meas. Tech.ChEMBL_307380 (CHEMBL835394)
Ki 1.1±n/a nM
Citation Khandelwal, ALukacova, VComez, DKroll, DMRaha, SBalaz, S A combination of docking, QM/MM methods, and MD simulation for binding affinity estimation of metalloprotein ligands. J Med Chem48:5437-47 (2005) 
 
Matrix metalloproteinase-9
Name:Matrix metalloproteinase-9
Type:Enzyme
Mol. Mass.:78452.28
Organism:Homo sapiens (Human)
Description:P14780
Residue:707
BDBM50024401
NameBDBM50024401
Synonyms:CHEMBL190712
TypeSmall organic molecule
Emp. Form.C21H26N3O5P
Mol. Mass.431.422
SMILESCCOP(=O)(N1CC2Nc3ccccc3C2C[C@@H]1C(=O)NO)c1ccc(OC)cc1