Reaction Details
TargetCocaine esterase
LigandBDBM50171924
Substrate/Competitorn/a
Meas. Tech.ChEMBL_303811 (CHEMBL827070)
Ki 85±n/a nM
Citation Hyatt, JLStacy, VWadkins, RMYoon, KJWierdl, MEdwards, CCZeller, MHunter, ADDanks, MKCrundwell, GPotter, PM Inhibition of carboxylesterases by benzil (diphenylethane-1,2-dione) and heterocyclic analogues is dependent upon the aromaticity of the ring and the flexibility of the dione moiety. J Med Chem48:5543-50 (2005) 
 
Cocaine esterase
Name:Cocaine esterase
Type:PROTEIN
Mol. Mass.:61801.08
Organism:Homo sapiens (Human)
Description:ChEMBL_1494240
Residue:559
BDBM50171924
NameBDBM50171924
Synonyms:1,2-Di-naphthalen-2-yl-ethane-1,2-dione CHEMBL189162
TypeSmall organic molecule
Emp. Form.C22H14O2
Mol. Mass.310.3454
SMILESO=C(C(=O)c1ccc2ccccc2c1)c1ccc2ccccc2c1