Reaction Details
TargetAcetylcholinesterase
LigandBDBM50171920
Substrate/Competitorn/a
Meas. Tech.ChEMBL_303485 (CHEMBL838859)
Ki>100000±n/a nM
Citation Hyatt, JLStacy, VWadkins, RMYoon, KJWierdl, MEdwards, CCZeller, MHunter, ADDanks, MKCrundwell, GPotter, PM Inhibition of carboxylesterases by benzil (diphenylethane-1,2-dione) and heterocyclic analogues is dependent upon the aromaticity of the ring and the flexibility of the dione moiety. J Med Chem48:5543-50 (2005) 
 
Acetylcholinesterase
Name:Acetylcholinesterase
Type:Enzyme
Mol. Mass.:67792.70
Organism:Homo sapiens (Human)
Description:P22303
Residue:614
BDBM50171920
NameBDBM50171920
Synonyms:2-Hydroxy-1,2-di-thiophen-2-yl-ethanone | CHEMBL190660
TypeSmall organic molecule
Emp. Form.C10H8O2S2
Mol. Mass.224.299
SMILESOC(C(=O)c1cccs1)c1cccs1