Reaction Details
TargetAcetylcholinesterase
LigandBDBM50171926
Substrate/Competitorn/a
Meas. Tech.ChEMBL_303485 (CHEMBL838859)
Ki>100000±n/a nM
Citation Hyatt, JLStacy, VWadkins, RMYoon, KJWierdl, MEdwards, CCZeller, MHunter, ADDanks, MKCrundwell, GPotter, PM Inhibition of carboxylesterases by benzil (diphenylethane-1,2-dione) and heterocyclic analogues is dependent upon the aromaticity of the ring and the flexibility of the dione moiety. J Med Chem48:5543-50 (2005) 
 
Acetylcholinesterase
Name:Acetylcholinesterase
Type:Enzyme
Mol. Mass.:67792.70
Organism:Homo sapiens (Human)
Description:P22303
Residue:614
BDBM50171926
NameBDBM50171926
Synonyms:1,2-Di-pyridin-2-yl-ethane-1,2-dione 1,2-diketone, 2,2'-pyridil | CHEMBL373345
TypeSmall organic molecule
Emp. Form.C12H8N2O2
Mol. Mass.212.2041
SMILESO=C(C(=O)c1ccccn1)c1ccccn1