Reaction Details
TargetLiver carboxylesterase 1
LigandBDBM50171925
Substrate/Competitorn/a
Meas. Tech.ChEMBL_303802 (CHEMBL829851)
Ki 30±n/a nM
Citation Hyatt, JLStacy, VWadkins, RMYoon, KJWierdl, MEdwards, CCZeller, MHunter, ADDanks, MKCrundwell, GPotter, PM Inhibition of carboxylesterases by benzil (diphenylethane-1,2-dione) and heterocyclic analogues is dependent upon the aromaticity of the ring and the flexibility of the dione moiety. J Med Chem48:5543-50 (2005) 
 
Liver carboxylesterase 1
Name:Liver carboxylesterase 1
Type:Protein
Mol. Mass.:62520.83
Organism:Homo sapiens (Human)
Description:n/a
Residue:567
BDBM50171925
NameBDBM50171925
Synonyms:1,2-Bis-(4-bromo-thiophen-2-yl)-ethane-1,2-dione CHEMBL190672
TypeSmall organic molecule
Emp. Form.C10H4Br2O2S2
Mol. Mass.380.076
SMILESBrc1csc(c1)C(=O)C(=O)c1cc(Br)cs1