Reaction Details
TargetLiver carboxylesterase 1
LigandBDBM50171922
Substrate/Competitorn/a
Meas. Tech.ChEMBL_303802 (CHEMBL829851)
Ki 212±n/a nM
Citation Hyatt, JLStacy, VWadkins, RMYoon, KJWierdl, MEdwards, CCZeller, MHunter, ADDanks, MKCrundwell, GPotter, PM Inhibition of carboxylesterases by benzil (diphenylethane-1,2-dione) and heterocyclic analogues is dependent upon the aromaticity of the ring and the flexibility of the dione moiety. J Med Chem48:5543-50 (2005) 
 
Liver carboxylesterase 1
Name:Liver carboxylesterase 1
Type:Protein
Mol. Mass.:62520.83
Organism:Homo sapiens (Human)
Description:n/a
Residue:567
BDBM50171922
NameBDBM50171922
Synonyms:1,2-Di-thiophen-2-yl-ethane-1,2-dione CHEMBL365445
TypeSmall organic molecule
Emp. Form.C10H6O2S2
Mol. Mass.222.283
SMILESO=C(C(=O)c1cccs1)c1cccs1