Reaction Details
TargetSerine/threonine-protein kinase N1
LigandBDBM27394
Substrate/Competitorn/a
Meas. Tech.ChEMBL_2221494 (CHEMBL5134828)
IC50 4500±n/a nM
Citation Scott, FFala, AMTakarada, JEFicu, MPPennicott, LEReuillon, TDCouņago, RMMassirer, KBElkins, JMWard, SE Development of dihydropyrrolopyridinone-based PKN2/PRK2 chemical tools to enable drug discovery. Bioorg Med Chem Lett60:0 (2022) 
 
Serine/threonine-protein kinase N1
Name:Serine/threonine-protein kinase N1
Type:PROTEIN
Mol. Mass.:103928.39
Organism:Homo sapiens (Human)
Description:ChEMBL_1433150
Residue:942
BDBM27394
NameBDBM27394
Synonyms:1-methyl-2-(pyridin-4-yl)-1H,4H,5H,6H,7H-pyrrolo[3,2-c]pyridin-4-one | pyrrolopyridinone scaffold, 16
TypeSmall organic molecule
Emp. Form.C13H13N3O
Mol. Mass.227.2618
SMILESCn1c2CCNC(=O)c2cc1-c1ccncc1