Reaction Details
TargetSerine/threonine-protein kinase N1
LigandBDBM50596595
Substrate/Competitorn/a
Meas. Tech.ChEMBL_2221494 (CHEMBL5134828)
IC50 1840±n/a nM
Citation Scott, FFala, AMTakarada, JEFicu, MPPennicott, LEReuillon, TDCouņago, RMMassirer, KBElkins, JMWard, SE Development of dihydropyrrolopyridinone-based PKN2/PRK2 chemical tools to enable drug discovery. Bioorg Med Chem Lett60:0 (2022) 
 
Serine/threonine-protein kinase N1
Name:Serine/threonine-protein kinase N1
Type:PROTEIN
Mol. Mass.:103928.39
Organism:Homo sapiens (Human)
Description:ChEMBL_1433150
Residue:942
BDBM50596595
NameBDBM50596595
Synonyms:CHEMBL5187643
TypeSmall organic molecule
Emp. Form.C15H17N3O
Mol. Mass.255.315
SMILESCC(C)n1c2CCNC(=O)c2cc1-c1ccncc1