Reaction Details
TargetCytochrome P450 1A2
LigandBDBM50172118
Substrate/Competitorn/a
Meas. Tech.ChEMBL_321392 (CHEMBL880627)
IC50>20000±n/a nM
Citation Chua, PCNagasawa, JYBleicher, LSMunoz, BSchweiger, EJTehrani, LAnderson, JJCramer, MChung, JGreen, MDKing, CDReyes-Manalo, GCosford, ND Cyclohexenyl- and dehydropiperidinyl-alkynyl pyridines as potent metabotropic glutamate subtype 5 (mGlu5) receptor antagonists. Bioorg Med Chem Lett15:4589-93 (2005) 
 
Cytochrome P450 1A2
Name:Cytochrome P450 1A2
Type:Enzyme
Mol. Mass.:58423.38
Organism:Homo sapiens (Human)
Description:P05177
Residue:516
BDBM50172118
NameBDBM50172118
Synonyms:2-[1-(Toluene-4-sulfonyl)-1,2,3,6-tetrahydro-pyridin-4-ylethynyl]-pyridine | CHEMBL194538
TypeSmall organic molecule
Emp. Form.C19H18N2O2S
Mol. Mass.338.423
SMILESCc1ccc(cc1)S(=O)(=O)N1CCC(=CC1)C#Cc1ccccn1