Reaction Details
TargetMetabotropic glutamate receptor 5
LigandBDBM50172119
Substrate/Competitorn/a
Meas. Tech.ChEMBL_320949 (CHEMBL882468)
Ki 3.1±n/a nM
Citation Chua, PCNagasawa, JYBleicher, LSMunoz, BSchweiger, EJTehrani, LAnderson, JJCramer, MChung, JGreen, MDKing, CDReyes-Manalo, GCosford, ND Cyclohexenyl- and dehydropiperidinyl-alkynyl pyridines as potent metabotropic glutamate subtype 5 (mGlu5) receptor antagonists. Bioorg Med Chem Lett15:4589-93 (2005) 
 
Metabotropic glutamate receptor 5
Name:Metabotropic glutamate receptor 5
Type:Enzyme
Mol. Mass.:131900.14
Organism:Rattus norvegicus (Rat)
Description:P31424
Residue:1203
BDBM50172119
NameBDBM50172119
Synonyms:2-[1-(4-Bromo-benzenesulfonyl)-1,2,3,6-tetrahydro-pyridin-4-ylethynyl]-pyridine | CHEMBL197724
TypeSmall organic molecule
Emp. Form.C18H15BrN2O2S
Mol. Mass.403.293
SMILESBrc1ccc(cc1)S(=O)(=O)N1CCC(=CC1)C#Cc1ccccn1