Reaction Details
TargetMetabotropic glutamate receptor 5
LigandBDBM50172120
Substrate/Competitorn/a
Meas. Tech.ChEMBL_320949 (CHEMBL882468)
Ki 163±n/a nM
Citation Chua, PCNagasawa, JYBleicher, LSMunoz, BSchweiger, EJTehrani, LAnderson, JJCramer, MChung, JGreen, MDKing, CDReyes-Manalo, GCosford, ND Cyclohexenyl- and dehydropiperidinyl-alkynyl pyridines as potent metabotropic glutamate subtype 5 (mGlu5) receptor antagonists. Bioorg Med Chem Lett15:4589-93 (2005) 
 
Metabotropic glutamate receptor 5
Name:Metabotropic glutamate receptor 5
Type:Enzyme
Mol. Mass.:131900.14
Organism:Rattus norvegicus (Rat)
Description:P31424
Residue:1203
BDBM50172120
NameBDBM50172120
Synonyms:2-Cyclohexylethynyl-pyridine | CHEMBL195965
TypeSmall organic molecule
Emp. Form.C13H15N
Mol. Mass.185.2649
SMILESC1CCC(CC1)C#Cc1ccccn1