Reaction Details
TargetMetabotropic glutamate receptor 5
LigandBDBM50172129
Substrate/Competitorn/a
Meas. Tech.ChEMBL_320949 (CHEMBL882468)
Ki 20±n/a nM
Citation Chua, PCNagasawa, JYBleicher, LSMunoz, BSchweiger, EJTehrani, LAnderson, JJCramer, MChung, JGreen, MDKing, CDReyes-Manalo, GCosford, ND Cyclohexenyl- and dehydropiperidinyl-alkynyl pyridines as potent metabotropic glutamate subtype 5 (mGlu5) receptor antagonists. Bioorg Med Chem Lett15:4589-93 (2005) 
 
Metabotropic glutamate receptor 5
Name:Metabotropic glutamate receptor 5
Type:Enzyme
Mol. Mass.:131900.14
Organism:Rattus norvegicus (Rat)
Description:P31424
Residue:1203
BDBM50172129
NameBDBM50172129
Synonyms:4-Pyridin-2-ylethynyl-3,6-dihydro-2H-pyridine-1-carboxylic acid tert-butyl ester | CHEMBL196574
TypeSmall organic molecule
Emp. Form.C17H20N2O2
Mol. Mass.284.3529
SMILESCC(C)(C)OC(=O)N1CCC(=CC1)C#Cc1ccccn1