Reaction Details
TargetMetabotropic glutamate receptor 5
LigandBDBM50172124
Substrate/Competitorn/a
Meas. Tech.ChEMBL_320949 (CHEMBL882468)
Ki 75±n/a nM
Citation Chua, PCNagasawa, JYBleicher, LSMunoz, BSchweiger, EJTehrani, LAnderson, JJCramer, MChung, JGreen, MDKing, CDReyes-Manalo, GCosford, ND Cyclohexenyl- and dehydropiperidinyl-alkynyl pyridines as potent metabotropic glutamate subtype 5 (mGlu5) receptor antagonists. Bioorg Med Chem Lett15:4589-93 (2005) 
 
Metabotropic glutamate receptor 5
Name:Metabotropic glutamate receptor 5
Type:Enzyme
Mol. Mass.:131900.14
Organism:Rattus norvegicus (Rat)
Description:P31424
Residue:1203
BDBM50172124
NameBDBM50172124
Synonyms:2-[3-(Naphthalen-2-ylsulfanyl)-cyclohex-1-enylethynyl]-pyridine | CHEMBL196343
TypeSmall organic molecule
Emp. Form.C23H19NS
Mol. Mass.341.469
SMILESC1CC(Sc2ccc3ccccc3c2)C=C(C1)C#Cc1ccccn1