Reaction Details
TargetDipeptidyl peptidase 4
LigandBDBM50172141
Substrate/Competitorn/a
Meas. Tech.ChEMBL_321015 (CHEMBL883648)
Ki 61±n/a nM
Citation Hulin, BCabral, SLopaze, MGVan Volkenburg, MAAndrews, KMParker, JC New fluorinated pyrrolidine and azetidine amides as dipeptidyl peptidase IV inhibitors. Bioorg Med Chem Lett15:4770-3 (2005) 
 
Dipeptidyl peptidase 4
Name:Dipeptidyl peptidase 4
Type:Enzyme
Mol. Mass.:88271.01
Organism:Homo sapiens (Human)
Description:P27487
Residue:766
BDBM50172141
NameBDBM50172141
Synonyms:(S)-2-Amino-2-cyclohexyl-1-(3,4-difluoro-pyrrolidin-1-yl)-ethanone | CHEMBL196179
TypeSmall organic molecule
Emp. Form.C12H20F2N2O
Mol. Mass.246.2968
SMILESN[C@@H](C1CCCCC1)C(=O)N1CC(F)C(F)C1