Reaction Details
TargetDipeptidyl peptidase 4
LigandBDBM50172144
Substrate/Competitorn/a
Meas. Tech.ChEMBL_320814 (CHEMBL872349)
Ki 81±n/a nM
Citation Hulin, BCabral, SLopaze, MGVan Volkenburg, MAAndrews, KMParker, JC New fluorinated pyrrolidine and azetidine amides as dipeptidyl peptidase IV inhibitors. Bioorg Med Chem Lett15:4770-3 (2005) 
 
Dipeptidyl peptidase 4
Name:Dipeptidyl peptidase 4
Type:Enzyme
Mol. Mass.:88271.01
Organism:Homo sapiens (Human)
Description:P27487
Residue:766
BDBM50172144
NameBDBM50172144
Synonyms:(S)-2-Amino-2-cyclohexyl-1-(2,3,4,5-tetrafluoro-pyrrolidin-1-yl)-ethanone | CHEMBL196545
TypeSmall organic molecule
Emp. Form.C12H18F4N2O
Mol. Mass.282.2777
SMILESN[C@@H](C1CCCCC1)C(=O)N1C(F)C(F)C(F)C1F