Reaction Details
TargetP2X purinoceptor 7
LigandBDBM50596640
Substrate/Competitorn/a
Meas. Tech.ChEMBL_2221605 (CHEMBL5134939)
EC50 6084±n/a nM
Citation Mahmood, AAli Shah, SJIqbal, J Design and synthesis of adamantane-1-carbonyl thiourea derivatives as potent and selective inhibitors of h-P2X4 and h-P2X7 receptors: An Emerging therapeutic tool for treatment of inflammation and neurological disorders. Eur J Med Chem231:0 (2022) 
 
P2X purinoceptor 7
Name:P2X purinoceptor 7
Type:Protein
Mol. Mass.:68602.85
Organism:Homo sapiens (Human)
Description:Q99572
Residue:595
BDBM50596640
NameBDBM50596640
Synonyms:CHEMBL5194775
TypeSmall organic molecule
Emp. Form.C21H23N3OS
Mol. Mass.365.492
SMILESO=C(NC(=S)Nc1cccc2cccnc12)C12CC3CC(CC(C3)C1)C2