Reaction Details
Target5-hydroxytryptamine receptor 6
LigandBDBM50172300
Substrate/Competitorn/a
Meas. Tech.ChEMBL_320876 (CHEMBL884801)
Ki 10±n/a nM
Citation Cole, DCLennox, WJStock, JREllingboe, JWMazandarani, HSmith, DLZhang, GTawa, GJSchechter, LE Conformationally constrained N1-arylsulfonyltryptamine derivatives as 5-HT6 receptor antagonists. Bioorg Med Chem Lett15:4780-5 (2005) 
 
5-hydroxytryptamine receptor 6
Name:5-hydroxytryptamine receptor 6
Type:G Protein-Coupled Receptor (GPCR)
Mol. Mass.:46968.43
Organism:Homo sapiens (Human)
Description:P50406
Residue:440
BDBM50172300
NameBDBM50172300
Synonyms:3-Piperidin-3-yl-1-(4-trifluoromethyl-benzenesulfonyl)-1H-indole | CHEMBL196743
TypeSmall organic molecule
Emp. Form.C20H19F3N2O2S
Mol. Mass.408.437
SMILESFC(F)(F)c1ccc(cc1)S(=O)(=O)n1cc(C2CCCNC2)c2ccccc12