Reaction Details
Target5-hydroxytryptamine receptor 6
LigandBDBM50172260
Substrate/Competitorn/a
Meas. Tech.ChEMBL_320876 (CHEMBL884801)
Ki 5±n/a nM
Citation Cole, DCLennox, WJStock, JREllingboe, JWMazandarani, HSmith, DLZhang, GTawa, GJSchechter, LE Conformationally constrained N1-arylsulfonyltryptamine derivatives as 5-HT6 receptor antagonists. Bioorg Med Chem Lett15:4780-5 (2005) 
 
5-hydroxytryptamine receptor 6
Name:5-hydroxytryptamine receptor 6
Type:G Protein-Coupled Receptor (GPCR)
Mol. Mass.:46968.43
Organism:Homo sapiens (Human)
Description:P50406
Residue:440
BDBM50172260
NameBDBM50172260
Synonyms:1-(3,4-Dimethoxy-benzenesulfonyl)-3-(1-methyl-pyrrolidin-3-yl)-1H-indole | CHEMBL196619
TypeSmall organic molecule
Emp. Form.C21H24N2O4S
Mol. Mass.400.491
SMILESCOc1ccc(cc1OC)S(=O)(=O)n1cc(C2CCN(C)C2)c2ccccc12