Reaction Details
Target5-hydroxytryptamine receptor 6
LigandBDBM50172281
Substrate/Competitorn/a
Meas. Tech.ChEMBL_320876 (CHEMBL884801)
Ki 9.2±n/a nM
Citation Cole, DCLennox, WJStock, JREllingboe, JWMazandarani, HSmith, DLZhang, GTawa, GJSchechter, LE Conformationally constrained N1-arylsulfonyltryptamine derivatives as 5-HT6 receptor antagonists. Bioorg Med Chem Lett15:4780-5 (2005) 
 
5-hydroxytryptamine receptor 6
Name:5-hydroxytryptamine receptor 6
Type:G Protein-Coupled Receptor (GPCR)
Mol. Mass.:46968.43
Organism:Homo sapiens (Human)
Description:P50406
Residue:440
BDBM50172281
NameBDBM50172281
Synonyms:1-(2-Fluoro-benzenesulfonyl)-3-(1,2,5,6-tetrahydro-pyridin-3-yl)-1H-indole | CHEMBL363827
TypeSmall organic molecule
Emp. Form.C19H17FN2O2S
Mol. Mass.356.414
SMILESFc1ccccc1S(=O)(=O)n1cc(C2=CCCNC2)c2ccccc12