Reaction Details
Target5-hydroxytryptamine receptor 6
LigandBDBM34147
Substrate/Competitorn/a
Meas. Tech.ChEMBL_320876 (CHEMBL884801)
Ki 1±n/a nM
Citation Cole, DCLennox, WJStock, JREllingboe, JWMazandarani, HSmith, DLZhang, GTawa, GJSchechter, LE Conformationally constrained N1-arylsulfonyltryptamine derivatives as 5-HT6 receptor antagonists. Bioorg Med Chem Lett15:4780-5 (2005) 
 
5-hydroxytryptamine receptor 6
Name:5-hydroxytryptamine receptor 6
Type:G Protein-Coupled Receptor (GPCR)
Mol. Mass.:46968.43
Organism:Homo sapiens (Human)
Description:P50406
Residue:440
BDBM34147
NameBDBM34147
Synonyms:CHEMBL425196 | pyrrolidinylindole, 6
TypeSmall organic molecule
Emp. Form.C19H19BrN2O2S
Mol. Mass.419.335
SMILESCN1CCC(C1)c1cn(c2ccccc12)S(=O)(=O)c1ccccc1Br