Reaction Details
Target5-hydroxytryptamine receptor 6
LigandBDBM50172262
Substrate/Competitorn/a
Meas. Tech.ChEMBL_320876 (CHEMBL884801)
Ki 8±n/a nM
Citation Cole, DCLennox, WJStock, JREllingboe, JWMazandarani, HSmith, DLZhang, GTawa, GJSchechter, LE Conformationally constrained N1-arylsulfonyltryptamine derivatives as 5-HT6 receptor antagonists. Bioorg Med Chem Lett15:4780-5 (2005) 
 
5-hydroxytryptamine receptor 6
Name:5-hydroxytryptamine receptor 6
Type:G Protein-Coupled Receptor (GPCR)
Mol. Mass.:46968.43
Organism:Homo sapiens (Human)
Description:P50406
Residue:440
BDBM50172262
NameBDBM50172262
Synonyms:1-(5-Chloro-3-methyl-pyrazol-1-ylmethanesulfonyl)-3-(1,2,5,6-tetrahydro-pyridin-3-yl)-1H-indole | CHEMBL197845
TypeSmall organic molecule
Emp. Form.C18H19ClN4O2S
Mol. Mass.390.887
SMILESCc1cc(Cl)n(CS(=O)(=O)n2cc(C3=CCCNC3)c3ccccc23)n1