Reaction Details
Target5-hydroxytryptamine receptor 6
LigandBDBM34148
Substrate/Competitorn/a
Meas. Tech.ChEMBL_322130 (CHEMBL884381)
EC50 36±n/a nM
Citation Cole, DCLennox, WJStock, JREllingboe, JWMazandarani, HSmith, DLZhang, GTawa, GJSchechter, LE Conformationally constrained N1-arylsulfonyltryptamine derivatives as 5-HT6 receptor antagonists. Bioorg Med Chem Lett15:4780-5 (2005) 
 
5-hydroxytryptamine receptor 6
Name:5-hydroxytryptamine receptor 6
Type:G Protein-Coupled Receptor (GPCR)
Mol. Mass.:46968.43
Organism:Homo sapiens (Human)
Description:P50406
Residue:440
BDBM34148
NameBDBM34148
Synonyms:CHEMBL371292 | piperidinylindole, 7
TypeSmall organic molecule
Emp. Form.C19H20N2O2S
Mol. Mass.340.439
SMILESO=S(=O)(c1ccccc1)n1cc(C2CCCNC2)c2ccccc12