Reaction Details
Target5-hydroxytryptamine receptor 6
LigandBDBM50172313
Substrate/Competitorn/a
Meas. Tech.ChEMBL_320876 (CHEMBL884801)
Ki 3±n/a nM
Citation Cole, DCLennox, WJStock, JREllingboe, JWMazandarani, HSmith, DLZhang, GTawa, GJSchechter, LE Conformationally constrained N1-arylsulfonyltryptamine derivatives as 5-HT6 receptor antagonists. Bioorg Med Chem Lett15:4780-5 (2005) 
 
5-hydroxytryptamine receptor 6
Name:5-hydroxytryptamine receptor 6
Type:G Protein-Coupled Receptor (GPCR)
Mol. Mass.:46968.43
Organism:Homo sapiens (Human)
Description:P50406
Residue:440
BDBM50172313
NameBDBM50172313
Synonyms:1-(5-Chloro-thiophene-2-sulfonyl)-3-piperidin-3-yl-1H-indole | CHEMBL371318
TypeSmall organic molecule
Emp. Form.C17H17ClN2O2S2
Mol. Mass.380.912
SMILESClc1ccc(s1)S(=O)(=O)n1cc(C2CCCNC2)c2ccccc12