Reaction Details
Target5-hydroxytryptamine receptor 6
LigandBDBM50172302
Substrate/Competitorn/a
Meas. Tech.ChEMBL_320876 (CHEMBL884801)
Ki 7±n/a nM
Citation Cole, DCLennox, WJStock, JREllingboe, JWMazandarani, HSmith, DLZhang, GTawa, GJSchechter, LE Conformationally constrained N1-arylsulfonyltryptamine derivatives as 5-HT6 receptor antagonists. Bioorg Med Chem Lett15:4780-5 (2005) 
 
5-hydroxytryptamine receptor 6
Name:5-hydroxytryptamine receptor 6
Type:G Protein-Coupled Receptor (GPCR)
Mol. Mass.:46968.43
Organism:Homo sapiens (Human)
Description:P50406
Residue:440
BDBM50172302
NameBDBM50172302
Synonyms:1-(3,4-Difluoro-benzenesulfonyl)-3-piperidin-3-yl-1H-indole | CHEMBL363843
TypeSmall organic molecule
Emp. Form.C19H18F2N2O2S
Mol. Mass.376.42
SMILESFc1ccc(cc1F)S(=O)(=O)n1cc(C2CCCNC2)c2ccccc12