Reaction Details
TargetMelanin-concentrating hormone receptor 1
LigandBDBM50150073
Substrate/Competitorn/a
Meas. Tech.ChEMBL_321618 (CHEMBL871627)
IC50 2.3±n/a nM
Citation Ulven, TFrimurer, TMReceveur, JMLittle, PBRist, ONørregaard, PKHögberg, T 6-Acylamino-2-aminoquinolines as potent melanin-concentrating hormone 1 receptor antagonists. Identification, structure-activity relationship, and investigation of binding mode. J Med Chem48:5684-97 (2005) 
 
Melanin-concentrating hormone receptor 1
Name:Melanin-concentrating hormone receptor 1
Type:G Protein-Coupled Receptor (GPCR)
Mol. Mass.:45976.27
Organism:Homo sapiens (Human)
Description:Membranes from CHO-K1 cells stably expressing human MCH1R were used in assays.
Residue:422
BDBM50150073
NameBDBM50150073
Synonyms:CHEMBL184084 N-[4-Methyl-2-(4-methyl-piperazin-1-yl)-quinolin-6-yl]-2-(4-trifluoromethoxy-phenoxy)-acetamide
TypeSmall organic molecule
Emp. Form.C24H25F3N4O3
Mol. Mass.474.4755
SMILESCN1CCN(CC1)c1cc(C)c2cc(NC(=O)COc3ccc(OC(F)(F)F)cc3)ccc2n1