Reaction Details
TargetMelanin-concentrating hormone receptor 2
LigandBDBM50172430
Substrate/Competitorn/a
Meas. Tech.ChEMBL_321623 (CHEMBL871632)
IC50>10±n/a nM
Citation Ulven, TFrimurer, TMReceveur, JMLittle, PBRist, ONørregaard, PKHögberg, T 6-Acylamino-2-aminoquinolines as potent melanin-concentrating hormone 1 receptor antagonists. Identification, structure-activity relationship, and investigation of binding mode. J Med Chem48:5684-97 (2005) 
 
Melanin-concentrating hormone receptor 2
Name:Melanin-concentrating hormone receptor 2
Type:Enzyme Catalytic Domain
Mol. Mass.:38862.16
Organism:Homo sapiens (Human)
Description:Melanin Concentrating Hormone 2 GPR145 HUMAN::Q969V1
Residue:340
BDBM50172430
NameBDBM50172430
Synonyms:(E)-N-(4-Methyl-2-piperazin-1-yl-quinolin-6-yl)-3-(4-trifluoromethoxy-phenyl)-acrylamide | CHEMBL195351
TypeSmall organic molecule
Emp. Form.C24H23F3N4O2
Mol. Mass.456.4602
SMILESCc1cc(nc2ccc(NC(=O)\C=C\c3ccc(OC(F)(F)F)cc3)cc12)N1CCNCC1