Reaction Details
TargetMelanin-concentrating hormone receptor 1
LigandBDBM50172443
Substrate/Competitorn/a
Meas. Tech.ChEMBL_321621 (CHEMBL871630)
IC50 59±n/a nM
Citation Ulven, TFrimurer, TMReceveur, JMLittle, PBRist, ONørregaard, PKHögberg, T 6-Acylamino-2-aminoquinolines as potent melanin-concentrating hormone 1 receptor antagonists. Identification, structure-activity relationship, and investigation of binding mode. J Med Chem48:5684-97 (2005) 
 
Melanin-concentrating hormone receptor 1
Name:Melanin-concentrating hormone receptor 1
Type:G Protein-Coupled Receptor (GPCR)
Mol. Mass.:45976.27
Organism:Homo sapiens (Human)
Description:Membranes from CHO-K1 cells stably expressing human MCH1R were used in assays.
Residue:422
BDBM50172443
NameBDBM50172443
Synonyms:2-(2,4-Dichloro-phenoxy)-N-(4-methyl-2-morpholin-4-yl-quinolin-6-yl)-acetamide | CHEMBL196091
TypeSmall organic molecule
Emp. Form.C22H21Cl2N3O3
Mol. Mass.446.326
SMILESCc1cc(nc2ccc(NC(=O)COc3ccc(Cl)cc3Cl)cc12)N1CCOCC1