Reaction Details
TargetMelanin-concentrating hormone receptor 1
LigandBDBM50172445
Substrate/Competitorn/a
Meas. Tech.ChEMBL_321621 (CHEMBL871630)
IC50 2630±n/a nM
Citation Ulven, TFrimurer, TMReceveur, JMLittle, PBRist, ONørregaard, PKHögberg, T 6-Acylamino-2-aminoquinolines as potent melanin-concentrating hormone 1 receptor antagonists. Identification, structure-activity relationship, and investigation of binding mode. J Med Chem48:5684-97 (2005) 
 
Melanin-concentrating hormone receptor 1
Name:Melanin-concentrating hormone receptor 1
Type:G Protein-Coupled Receptor (GPCR)
Mol. Mass.:45976.27
Organism:Homo sapiens (Human)
Description:Membranes from CHO-K1 cells stably expressing human MCH1R were used in assays.
Residue:422
BDBM50172445
NameBDBM50172445
Synonyms:5-Chloro-N-[2-(4-ethyl-piperazin-1-yl)-4-methyl-quinolin-6-yl]-2-methoxy-benzamide | CHEMBL365374
TypeSmall organic molecule
Emp. Form.C24H27ClN4O2
Mol. Mass.438.95
SMILESCCN1CCN(CC1)c1cc(C)c2cc(NC(=O)c3cc(Cl)ccc3OC)ccc2n1