Reaction Details
TargetMelanin-concentrating hormone receptor 1
LigandBDBM50172438
Substrate/Competitorn/a
Meas. Tech.ChEMBL_322477 (CHEMBL884193)
IC50 109±n/a nM
Citation Ulven, TFrimurer, TMReceveur, JMLittle, PBRist, ONørregaard, PKHögberg, T 6-Acylamino-2-aminoquinolines as potent melanin-concentrating hormone 1 receptor antagonists. Identification, structure-activity relationship, and investigation of binding mode. J Med Chem48:5684-97 (2005) 
 
Melanin-concentrating hormone receptor 1
Name:Melanin-concentrating hormone receptor 1
Type:G Protein-Coupled Receptor (GPCR)
Mol. Mass.:45976.27
Organism:Homo sapiens (Human)
Description:Membranes from CHO-K1 cells stably expressing human MCH1R were used in assays.
Residue:422
BDBM50172438
NameBDBM50172438
Synonyms:CHEMBL194691 | N-{2-[(1-Ethyl-pyrrolidin-2-ylmethyl)-amino]-4-methyl-quinolin-6-yl}-2-(4-trifluoromethoxy-phenoxy)-acetamide
TypeSmall organic molecule
Emp. Form.C26H29F3N4O3
Mol. Mass.502.5287
SMILESCCN1CCCC1CNc1cc(C)c2cc(NC(=O)COc3ccc(OC(F)(F)F)cc3)ccc2n1