Reaction Details
TargetMelanin-concentrating hormone receptor 1
LigandBDBM50172415
Substrate/Competitorn/a
Meas. Tech.ChEMBL_322477 (CHEMBL884193)
IC50 11±n/a nM
Citation Ulven, TFrimurer, TMReceveur, JMLittle, PBRist, ONørregaard, PKHögberg, T 6-Acylamino-2-aminoquinolines as potent melanin-concentrating hormone 1 receptor antagonists. Identification, structure-activity relationship, and investigation of binding mode. J Med Chem48:5684-97 (2005) 
 
Melanin-concentrating hormone receptor 1
Name:Melanin-concentrating hormone receptor 1
Type:G Protein-Coupled Receptor (GPCR)
Mol. Mass.:45976.27
Organism:Homo sapiens (Human)
Description:Membranes from CHO-K1 cells stably expressing human MCH1R were used in assays.
Residue:422
BDBM50172415
NameBDBM50172415
Synonyms:2-(2,4-Dichloro-phenoxy)-N-{2-[(2-hydroxy-ethyl)-methyl-amino]-4-methyl-quinolin-6-yl}-acetamide | CHEMBL197245
TypeSmall organic molecule
Emp. Form.C21H21Cl2N3O3
Mol. Mass.434.316
SMILESCN(CCO)c1cc(C)c2cc(NC(=O)COc3ccc(Cl)cc3Cl)ccc2n1