Reaction Details
TargetCytochrome P450 3A4
LigandBDBM50172461
Substrate/Competitorn/a
Meas. Tech.ChEMBL_322414 (CHEMBL871890)
IC50 58000±n/a nM
Citation Peretto, IRadaelli, SParini, CZandi, MRaveglia, LFDondio, GFontanella, LMisiano, PBigogno, CRizzi, ARiccardi, BBiscaioli, MMarchetti, SPuccini, PCatinella, SRondelli, ICenacchi, VBolzoni, PTCaruso, PVilletti, GFacchinetti, FDel Giudice, EMoretto, NImbimbo, BP Synthesis and biological activity of flurbiprofen analogues as selective inhibitors of beta-amyloid(1)(-)(42) secretion. J Med Chem48:5705-20 (2005) 
 
Cytochrome P450 3A4
Name:Cytochrome P450 3A4
Type:Enzyme
Mol. Mass.:57349.57
Organism:Homo sapiens (Human)
Description:n/a
Residue:503
BDBM50172461
NameBDBM50172461
Synonyms:1-(2',2''-Difluoro-4-hydroxy-[1,1';4',1'']terphenyl-4''-yl)-cyclopropanecarboxylic acid | CHEMBL372846
TypeSmall organic molecule
Emp. Form.C22H16F2O3
Mol. Mass.366.3574
SMILESOC(=O)C1(CC1)c1ccc(c(F)c1)-c1ccc(c(F)c1)-c1ccc(O)cc1