Reaction Details
TargetCytochrome P450 3A4
LigandBDBM50172465
Substrate/Competitorn/a
Meas. Tech.ChEMBL_322414 (CHEMBL871890)
IC50 38000±n/a nM
Citation Peretto, IRadaelli, SParini, CZandi, MRaveglia, LFDondio, GFontanella, LMisiano, PBigogno, CRizzi, ARiccardi, BBiscaioli, MMarchetti, SPuccini, PCatinella, SRondelli, ICenacchi, VBolzoni, PTCaruso, PVilletti, GFacchinetti, FDel Giudice, EMoretto, NImbimbo, BP Synthesis and biological activity of flurbiprofen analogues as selective inhibitors of beta-amyloid(1)(-)(42) secretion. J Med Chem48:5705-20 (2005) 
 
Cytochrome P450 3A4
Name:Cytochrome P450 3A4
Type:Enzyme
Mol. Mass.:57349.57
Organism:Homo sapiens (Human)
Description:n/a
Residue:503
BDBM50172465
NameBDBM50172465
Synonyms:1-(4,2',2''-Trifluoro-[1,1';4',1'']terphenyl-4''-yl)-cyclopropanecarboxylic acid | CHEMBL427548
TypeSmall organic molecule
Emp. Form.C22H15F3O2
Mol. Mass.368.3485
SMILESOC(=O)C1(CC1)c1ccc(c(F)c1)-c1ccc(c(F)c1)-c1ccc(F)cc1