Reaction Details
TargetCytochrome P450 2C9
LigandBDBM50172468
Substrate/Competitorn/a
Meas. Tech.ChEMBL_322412 (CHEMBL871888)
IC50 19000±n/a nM
Citation Peretto, IRadaelli, SParini, CZandi, MRaveglia, LFDondio, GFontanella, LMisiano, PBigogno, CRizzi, ARiccardi, BBiscaioli, MMarchetti, SPuccini, PCatinella, SRondelli, ICenacchi, VBolzoni, PTCaruso, PVilletti, GFacchinetti, FDel Giudice, EMoretto, NImbimbo, BP Synthesis and biological activity of flurbiprofen analogues as selective inhibitors of beta-amyloid(1)(-)(42) secretion. J Med Chem48:5705-20 (2005) 
 
Cytochrome P450 2C9
Name:Cytochrome P450 2C9
Type:Enzyme
Mol. Mass.:55636.33
Organism:Homo sapiens (Human)
Description:P11712
Residue:490
BDBM50172468
NameBDBM50172468
Synonyms:1-(4-Benzo[b]thiophen-3-yl-3-fluoro-phenyl)-cyclopropanecarboxylic acid | CHEMBL196946
TypeSmall organic molecule
Emp. Form.C18H13FO2S
Mol. Mass.312.358
SMILESOC(=O)C1(CC1)c1ccc(-c2csc3ccccc23)c(F)c1