Reaction Details
TargetCytochrome P450 2D6
LigandBDBM50172459
Substrate/Competitorn/a
Meas. Tech.ChEMBL_322413 (CHEMBL871889)
IC50 21500±n/a nM
Citation Peretto, IRadaelli, SParini, CZandi, MRaveglia, LFDondio, GFontanella, LMisiano, PBigogno, CRizzi, ARiccardi, BBiscaioli, MMarchetti, SPuccini, PCatinella, SRondelli, ICenacchi, VBolzoni, PTCaruso, PVilletti, GFacchinetti, FDel Giudice, EMoretto, NImbimbo, BP Synthesis and biological activity of flurbiprofen analogues as selective inhibitors of beta-amyloid(1)(-)(42) secretion. J Med Chem48:5705-20 (2005) 
 
Cytochrome P450 2D6
Name:Cytochrome P450 2D6
Type:Protein
Mol. Mass.:55774.82
Organism:Homo sapiens (Human)
Description:P10635
Residue:497
BDBM50172459
NameBDBM50172459
Synonyms:1-(2-Fluoro-4''-hydroxy-[1,1';4',1'']terphenyl-4-yl)-cyclopropanecarboxylic acid | CHEMBL196947
TypeSmall organic molecule
Emp. Form.C22H17FO3
Mol. Mass.348.367
SMILESOC(=O)C1(CC1)c1ccc(c(F)c1)-c1ccc(cc1)-c1ccc(O)cc1