Reaction Details
TargetCytochrome P450 2C9
LigandBDBM50172482
Substrate/Competitorn/a
Meas. Tech.ChEMBL_322412 (CHEMBL871888)
IC50 38000±n/a nM
Citation Peretto, IRadaelli, SParini, CZandi, MRaveglia, LFDondio, GFontanella, LMisiano, PBigogno, CRizzi, ARiccardi, BBiscaioli, MMarchetti, SPuccini, PCatinella, SRondelli, ICenacchi, VBolzoni, PTCaruso, PVilletti, GFacchinetti, FDel Giudice, EMoretto, NImbimbo, BP Synthesis and biological activity of flurbiprofen analogues as selective inhibitors of beta-amyloid(1)(-)(42) secretion. J Med Chem48:5705-20 (2005) 
 
Cytochrome P450 2C9
Name:Cytochrome P450 2C9
Type:Enzyme
Mol. Mass.:55636.33
Organism:Homo sapiens (Human)
Description:P11712
Residue:490
BDBM50172482
NameBDBM50172482
Synonyms:1-(3',4'-Dichloro-2-fluoro-biphenyl-4-yl)-cyclopropanecarboxylic acid | CHEMBL196945
TypeSmall organic molecule
Emp. Form.C16H11Cl2FO2
Mol. Mass.325.162
SMILESOC(=O)C1(CC1)c1ccc(c(F)c1)-c1ccc(Cl)c(Cl)c1