Reaction Details
TargetFibroblast growth factor receptor 2
LigandBDBM50596830
Substrate/Competitorn/a
Meas. Tech.ChEMBL_2222384 (CHEMBL5135718)
IC50<0.500000±n/a nM
Citation Ryu, SNam, YKim, NShin, IJeon, EKim, YKim, NDSim, T Identification of Pyridinyltriazine Derivatives as Potent panFGFR Inhibitors against Gatekeeper Mutants for Overcoming Drug Resistance. J Med Chem65:6017-6038 (2022) 
 
Fibroblast growth factor receptor 2
Name:Fibroblast growth factor receptor 2
Type:Enzyme
Mol. Mass.:92015.45
Organism:Homo sapiens (Human)
Description:P21802
Residue:821
BDBM50596830
NameBDBM50596830
Synonyms:CHEMBL5179166
TypeSmall organic molecule
Emp. Form.C28H30Cl2N8O2
Mol. Mass.581.496
SMILESCCN1CCN(CC1)c1ccc(Nc2ncnc(n2)-c2cccnc2Nc2c(Cl)c(OC)cc(OC)c2Cl)cc1