Reaction Details
TargetFibroblast growth factor receptor 2
LigandBDBM50525939
Substrate/Competitorn/a
Meas. Tech.ChEMBL_2222384 (CHEMBL5135718)
IC50<0.500000±n/a nM
Citation Ryu, SNam, YKim, NShin, IJeon, EKim, YKim, NDSim, T Identification of Pyridinyltriazine Derivatives as Potent panFGFR Inhibitors against Gatekeeper Mutants for Overcoming Drug Resistance. J Med Chem65:6017-6038 (2022) 
 
Fibroblast growth factor receptor 2
Name:Fibroblast growth factor receptor 2
Type:Enzyme
Mol. Mass.:92015.45
Organism:Homo sapiens (Human)
Description:P21802
Residue:821
BDBM50525939
NameBDBM50525939
Synonyms:Balversa Jnj-42756493
TypeSmall organic molecule
Emp. Form.C25H30N6O2
Mol. Mass.446.5447
SMILESCOc1cc(OC)cc(c1)N(CCNC(C)C)c1ccc2ncc(nc2c1)-c1cnn(C)c1